RaptorCam2 make problem

asked 2013-11-07 08:28:19 -0600

Insider gravatar image

Hello, today I was trying to install the RaptorCam2 software on my Fedora 19 system with GNOME 3. I have doing all, how the tutorial says, but when I was come to step 2. #make I become a problem:

Building USB Video Class driver...
make[1]: Entering directory `/usr/src/kernels/3.11.6-201.fc19.x86_64'
  CC [M]  /home/igrebel/Downloads/generic-64380-4.3.0/host/Linux/uvcdriver/src/uvcvideo-next/uvc_driver.o
/home/igrebel/Downloads/generic-64380-4.3.0/host/Linux/uvcdriver/src/uvcvideo-next/uvc_driver.c: In Funktion »uvc_register_video«:
/home/igrebel/Downloads/generic-64380-4.3.0/host/Linux/uvcdriver/src/uvcvideo-next/uvc_driver.c:1744:6: Fehler: »struct video_device« hat kein Element namens »parent«
  vdev->parent = &dev->intf->dev;
      ^
make[2]: *** [/home/igrebel/Downloads/generic-64380-4.3.0/host/Linux/uvcdriver/src/uvcvideo-next/uvc_driver.o] Fehler 1
make[1]: *** [_module_/home/igrebel/Downloads/generic-64380-4.3.0/host/Linux/uvcdriver/src/uvcvideo-next] Fehler 2
make[1]: Leaving directory `/usr/src/kernels/3.11.6-201.fc19.x86_64'
make: *** [all] Fehler 2

I hope you can help me

edit retag flag offensive close merge delete

Comments

I think it's best to report this at the makers of RaptorCam2

lnxslck gravatar imagelnxslck ( 2013-11-07 09:18:18 -0600 )edit